BDBM50068603 CHEMBL3402357
SMILES CN1CCN(Cc2ccc(cc2)C(=O)Nc2cccc(NC(C)=O)c2)CC1
InChI Key InChIKey=NGEQPNNOKIACDB-UHFFFAOYSA-N
Data  1 IC50
  Tab Delimited (TSV)   2D SDfile   Computed 3D by Vconf -m prep SDfile
Find this compound or compounds like it in BindingDB:
Activity Spreadsheet -- Enzyme Inhibition Constant Data from BindingDB
Found 1 hit for monomerid = 50068603
TargetTyrosine-protein kinase BTK(Homo sapiens (Human))
Carna Biosciences
Curated by ChEMBL
LigandPNGBDBM50068603(CHEMBL3402357)
Affinity DataIC50:  4.70E+3nM. Assay description: Inhibition of biotinylated and unactivated BTK (unknown origin) using FITC-labeled Srctide peptide substrate and ATP
In DepthDetails ArticlePubMed