BDBM50068680 3'-Amino-biphenyl-2-sulfonic acid (3,4-dimethyl-isoxazol-5-yl)-amide::CHEMBL424504
SMILES Cc1noc(NS(=O)(=O)c2ccccc2-c2cccc(N)c2)c1C
InChI Key InChIKey=JNMBQUUVMUDBGI-UHFFFAOYSA-N
Data  2 KI
  Tab Delimited (TSV)   2D SDfile   Computed 3D by Vconf -m prep SDfile
Find this compound or compounds like it in BindingDB:
Activity Spreadsheet -- Enzyme Inhibition Constant Data from BindingDB
Found 2 hits for monomerid = 50068680
TargetEndothelin-1 receptor(RAT)
Bristol-Myers Squibb Pharmaceutical Research Institute
Curated by ChEMBL
LigandPNGBDBM50068680(3'-Amino-biphenyl-2-sulfonic acid (3,4-dimethyl-is...)
Affinity DataKi:  62nM. Assay description: Ability to inhibit binding of [125I]ET1 to membranes prepared from A10 rat thoracic aorta smooth muscle Endothelin A receptor
In DepthDetails ArticlePubMed
TargetEndothelin receptor type B(RAT)
Bristol-Myers Squibb Pharmaceutical Research Institute
Curated by ChEMBL
LigandPNGBDBM50068680(3'-Amino-biphenyl-2-sulfonic acid (3,4-dimethyl-is...)
Affinity DataKi: >2.00E+5nM. Assay description: Ability to inhibit binding of [125I]-ET-1 to membranes prepared from A10 rat cerebellum (Endothelin B receptor)
In DepthDetails ArticlePubMed