BDBM50068781 6-(Oxazol-5-ylmethoxy)-6,9-dihydro-1H-purin-2-ylamine::CHEMBL150427
SMILES NC1=Nc2nc[nH]c2C(N1)OCc1cnco1
InChI Key InChIKey=RWZUNNQJTHSZPF-UHFFFAOYSA-N
Data  2 IC50
  Tab Delimited (TSV)   2D SDfile   Computed 3D by Vconf -m prep SDfile
Find this compound or compounds like it in BindingDB:
Activity Spreadsheet -- Enzyme Inhibition Constant Data from BindingDB
Found 2 hits for monomerid = 50068781
TargetMethylated-DNA--protein-cysteine methyltransferase(Homo sapiens (Human))
Trinity College
Curated by ChEMBL
LigandPNGBDBM50068781(6-(Oxazol-5-ylmethoxy)-6,9-dihydro-1H-purin-2-ylam...)
Affinity DataIC50:  350nM. Assay description: O6-Alkylguanine-DNA Alkyltransferase-Inactivating Activity (Concentration of inactivator required to produce 50% reduction in ATPase activity)
In DepthDetails ArticlePubMed
TargetMethylated-DNA--protein-cysteine methyltransferase(Homo sapiens (Human))
Trinity College
Curated by ChEMBL
LigandPNGBDBM50068781(6-(Oxazol-5-ylmethoxy)-6,9-dihydro-1H-purin-2-ylam...)
Affinity DataIC50:  220nM. Assay description: O6-Alkylguanine-DNA Alkyltransferase-Inactivating Activity in Raji cells (Concentration of inactivator required to produce 50% reduction in ATPase ac...
In DepthDetails ArticlePubMed