BDBM50068803 CHEMBL3402389
SMILES OCCOc1cccc(Nc2ncc(F)c(Nc3cccc(OCCO)c3)n2)c1
InChI Key InChIKey=GOEQHUWDAKTTIY-UHFFFAOYSA-N
Data  1 EC50
  Tab Delimited (TSV)   2D SDfile   Computed 3D by Vconf -m prep SDfile
Find this compound or compounds like it in BindingDB:
Activity Spreadsheet -- Enzyme Inhibition Constant Data from BindingDB
Found 1 hit for monomerid = 50068803
TargetTyrosine-protein kinase SYK(Homo sapiens (Human))
Amarit Bioscience
Curated by ChEMBL
LigandPNGBDBM50068803(CHEMBL3402389)
Affinity DataEC50:  930nM. Assay description: Inhibition of SYK in human mast cell cultures assessed as reduction in IgE-induced FCepsilonR1 mediated degranulation by tryptase release assay
In DepthDetails ArticlePubMed