BDBM50068849 (R)-2-[(4-Methoxy-benzenesulfonyl)-pyridin-2-ylmethyl-amino]-4-methyl-pentanoic acid hydroxyamide::CHEMBL170040
SMILES COc1ccc(cc1)S(=O)(=O)N(Cc1ccccn1)[C@H](CC(C)C)C(=O)NO
InChI Key InChIKey=UYFFUIVYRNCEPG-GOSISDBHSA-N
Data  1 IC50
  Tab Delimited (TSV)   2D SDfile   Computed 3D by Vconf -m prep SDfile
Find this compound or compounds like it in BindingDB:
Activity Spreadsheet -- Enzyme Inhibition Constant Data from BindingDB
Found 1 hit for monomerid = 50068849
TargetMacrophage metalloelastase(Mus musculus)
Novartis Pharmaceuticals
Curated by ChEMBL
LigandPNGBDBM50068849((R)-2-[(4-Methoxy-benzenesulfonyl)-pyridin-2-ylmet...)
Affinity DataIC50:  6.90nM. Assay description: Inhibitory activity against mouse macrophage metalloelastase (MME) using [3H]elastin as a substrate
In DepthDetails ArticlePubMed