BDBM50068855 CHEMBL3402384
SMILES COC(=O)COc1ccc(Nc2ncc(F)c(Nc3ccc(OCC(N)=O)cc3)n2)cc1
InChI Key InChIKey=QYCIWTPOVRMNHW-UHFFFAOYSA-N
Data  2 EC50
  Tab Delimited (TSV)   2D SDfile   Computed 3D by Vconf -m prep SDfile
Find this compound or compounds like it in BindingDB:
Activity Spreadsheet -- Enzyme Inhibition Constant Data from BindingDB
Found 2 hits for monomerid = 50068855
TargetTyrosine-protein kinase SYK(Homo sapiens (Human))
Amarit Bioscience
Curated by ChEMBL
LigandPNGBDBM50068855(CHEMBL3402384)
Affinity DataEC50:  2.48E+3nM. Assay description: Inhibition of SYK in human mast cell cultures assessed as reduction in ionomycin-induced calcium mobilization mediated degranulation by tryptase rele...
In DepthDetails ArticlePubMed
TargetTyrosine-protein kinase SYK(Homo sapiens (Human))
Amarit Bioscience
Curated by ChEMBL
LigandPNGBDBM50068855(CHEMBL3402384)
Affinity DataEC50:  430nM. Assay description: Inhibition of SYK in human mast cell cultures assessed as reduction in IgE-induced FCepsilonR1 mediated degranulation by tryptase release assay
In DepthDetails ArticlePubMed