BDBM50068856 CHEMBL3402383
SMILES Fc1cnc(Nc2ccc(OCC#N)cc2)nc1Nc1ccc(OCC#N)cc1
InChI Key InChIKey=BRBYRBZMLWKAMK-UHFFFAOYSA-N
Data  1 EC50
  Tab Delimited (TSV)   2D SDfile   Computed 3D by Vconf -m prep SDfile
Find this compound or compounds like it in BindingDB:
Activity Spreadsheet -- Enzyme Inhibition Constant Data from BindingDB
Found 1 hit for monomerid = 50068856
TargetTyrosine-protein kinase SYK(Homo sapiens (Human))
Amarit Bioscience
Curated by ChEMBL
LigandPNGBDBM50068856(CHEMBL3402383)
Affinity DataEC50:  370nM. Assay description: Inhibition of SYK in human mast cell cultures assessed as reduction in IgE-induced FCepsilonR1 mediated degranulation by tryptase release assay
In DepthDetails ArticlePubMed