BDBM50068897 CHEMBL171119::{(S)-1-[(S)-2-(1-Benzyl-3,3-difluoro-2-oxo-3-phenethylcarbamoyl-propylcarbamoyl)-pyrrolidine-1-carbonyl]-2-methyl-propyl}-carbamic acid tert-butyl ester
SMILES CC(C)[C@H](NC(=O)OC(C)(C)C)C(=O)N1CCC[C@H]1C(=O)NC(Cc1ccccc1)C(=O)C(F)(F)C(=O)NCCc1ccccc1
InChI Key InChIKey=LWXWUIXAWYQYBW-DCYPJBMNSA-N
Data  2 KI
  Tab Delimited (TSV)   2D SDfile   Computed 3D by Vconf -m prep SDfile
Find this compound or compounds like it in BindingDB:
Activity Spreadsheet -- Enzyme Inhibition Constant Data from BindingDB
Found 2 hits for monomerid = 50068897
TargetChymase(Homo sapiens (Human))
Green Cross Research Laboratories
Curated by ChEMBL
LigandPNGBDBM50068897(CHEMBL171119 | {(S)-1-[(S)-2-(1-Benzyl-3,3-difluor...)
Affinity DataKi:  18nM. Assay description: Compound was evaluated for inhibitory activity against human heart chymase (HHC)
In DepthDetails ArticlePubMed
TargetChymotrypsinogen A(Bos taurus (bovine))
Green Cross Research Laboratories
Curated by ChEMBL
LigandPNGBDBM50068897(CHEMBL171119 | {(S)-1-[(S)-2-(1-Benzyl-3,3-difluor...)
Affinity DataKi:  2.04E+3nM. Assay description: Compound was evaluated for inhibitory activity against Chymotrypsinogen
In DepthDetails ArticlePubMed