BDBM50068944 5-Morpholin-4-yl-3-(2-{3-[(naphthalene-2-carbonyl)-amino]-2-oxo-2H-pyridin-1-yl}-butyrylamino)-4-oxo-pentanoic acid::CHEMBL172905
SMILES CCC(C(=O)NC(CC(O)=O)C(=O)CN1CCOCC1)n1cccc(NC(=O)c2ccc3ccccc3c2)c1=O
InChI Key InChIKey=YZZAQNBDANYNEQ-UHFFFAOYSA-N
Data  1 KI
  Tab Delimited (TSV)   2D SDfile   Computed 3D by Vconf -m prep SDfile
Find this compound or compounds like it in BindingDB:
Activity Spreadsheet -- Enzyme Inhibition Constant Data from BindingDB
Found 1 hit for monomerid = 50068944
TargetCaspase-1(Homo sapiens (Human))
Ferring Research Institute
Curated by ChEMBL
LigandPNGBDBM50068944(5-Morpholin-4-yl-3-(2-{3-[(naphthalene-2-carbonyl)...)
Affinity DataKi:  45nM. Assay description: Inhibition of human recombinant IL-1 beta converting enzyme
In DepthDetails ArticlePubMed