BDBM50069281 4-Amino-5-chloro-N-(1-ethyl-azepan-3-yl)-2-methoxy-benzamide::CHEMBL347587
SMILES CCN1CCCCC(C1)NC(=O)c1cc(Cl)c(N)cc1OC
InChI Key InChIKey=UREJLDJPNXRLEF-UHFFFAOYSA-N
Data  2 IC50
  Tab Delimited (TSV)   2D SDfile   Computed 3D by Vconf -m prep SDfile
Find this compound or compounds like it in BindingDB:
Activity Spreadsheet -- Enzyme Inhibition Constant Data from BindingDB
Found 2 hits for monomerid = 50069281
Target5-hydroxytryptamine receptor 3A/3B(Rattus norvegicus)
Dainippon Pharmaceutical
Curated by ChEMBL
LigandPNGBDBM50069281(4-Amino-5-chloro-N-(1-ethyl-azepan-3-yl)-2-methoxy...)
Affinity DataIC50:  33nM. Assay description: Binding affinity against 5-hydroxytryptamine 3 receptor in rat cortical membrane using [3H]GR-65630 as radioligand
In DepthDetails ArticlePubMed
TargetD(2) dopamine receptor(Rattus norvegicus (rat))
Dainippon Pharmaceutical
Curated by ChEMBL
LigandPNGBDBM50069281(4-Amino-5-chloro-N-(1-ethyl-azepan-3-yl)-2-methoxy...)
Affinity DataIC50:  39nM. Assay description: Binding affinity against dopamine D2 receptor in rat brain synaptic membrane using [3H]-spiperone as radioligand
In DepthDetails ArticlePubMed