BDBM50069295 CHEMBL348175::N-methyl-N-cyclopropyl-3-(4-hydrazonoformamidephenyl)-2-[(2-naphthylsulfonyl)amino]propanamide
SMILES CN(C1CC1)C(=O)[C@H](Cc1ccc(cc1)C(N)=NN)NS(=O)(=O)c1ccc2ccccc2c1
InChI Key InChIKey=ZFZFIKYZTUDCCW-QFIPXVFZSA-N
Data  1 KI
  Tab Delimited (TSV)   2D SDfile   Computed 3D by Vconf -m prep SDfile
Find this compound or compounds like it in BindingDB:
Activity Spreadsheet -- Enzyme Inhibition Constant Data from BindingDB
Found 1 hit for monomerid = 50069295
TargetProthrombin(Bos taurus (Bovine))
Biotech Research Institute
Curated by ChEMBL
LigandPNGBDBM50069295(CHEMBL348175 | N-methyl-N-cyclopropyl-3-(4-hydrazo...)
Affinity DataKi:  247nM. Assay description: Compound was tested for inhibitory activity against bovine thrombin
In DepthDetails ArticlePubMed