BDBM50069314 CHEMBL346769::D-MYO-INOSITOL 1,2,4,5-TETRAKISPHOSPHATE
SMILES O[C@H]1[C@@H](OP([O-])([O-])=O)[C@@H](OP([O-])([O-])=O)[C@H](O)[C@@H](OP([O-])([O-])=O)[C@@H]1OP([O-])([O-])=O
InChI Key InChIKey=ZAWIXNGTTZTBKV-PCTUYBJVSA-F
Data  1 IC50
  Tab Delimited (TSV)   2D SDfile   Computed 3D by Vconf -m prep SDfile
Find this compound or compounds like it in BindingDB:
Activity Spreadsheet -- Enzyme Inhibition Constant Data from BindingDB
Found 1 hit for monomerid = 50069314
TargetInositol 1,4,5-trisphosphate receptor type 3(Bos taurus)
Pohang University Of Science & Technology
Curated by ChEMBL
LigandPNGBDBM50069314(CHEMBL346769 | D-MYO-INOSITOL 1,2,4,5-TETRAKISPHOS...)
Affinity DataIC50:  13nM. Assay description: Binding affinity towards Inositol 1,4,5-trisphosphate receptor was evaluated by the standard competitive binding assay using 1.25 nM [3H]-D-I(1,4,5)P...
In DepthDetails ArticlePubMed