BDBM50069453 (1R,2R)-3-Dimethylamino-2-naphthalen-2-yl-1-phenyl-propan-1-ol; hydrochloride::CHEMBL539050
SMILES CN(C)C[C@H]([C@@H](O)c1ccccc1)c1ccc2ccccc2c1
InChI Key InChIKey=NJZNJPXRRCEVDH-SFTDATJTSA-N
Data  3 KI  3 Kd
  Tab Delimited (TSV)   2D SDfile   Computed 3D by Vconf -m prep SDfile
Find this compound or compounds like it in BindingDB:
Activity Spreadsheet -- Enzyme Inhibition Constant Data from BindingDB
Found 6 hits for monomerid = 50069453
TargetSodium-dependent serotonin transporter(Rattus norvegicus (rat))
Hong Kong University Of Science And Technology
Curated by ChEMBL
LigandPNGBDBM50069453((1R,2R)-3-Dimethylamino-2-naphthalen-2-yl-1-phenyl...)
Affinity DataKi:  4.10nM. Assay description: Inhibition of [3H]5-HT reuptake into rat frontal cortex synaptosomes
In DepthDetails ArticlePubMed
TargetSodium-dependent dopamine transporter(Rattus norvegicus (rat))
Hong Kong University Of Science And Technology
Curated by ChEMBL
LigandPNGBDBM50069453((1R,2R)-3-Dimethylamino-2-naphthalen-2-yl-1-phenyl...)
Affinity DataKi:  12nM. Assay description: Inhibition of [3H]- DA reuptake into rat striatal synaptosomes
In DepthDetails ArticlePubMed
TargetTransporter(Rattus norvegicus)
Hong Kong University Of Science And Technology
Curated by ChEMBL
LigandPNGBDBM50069453((1R,2R)-3-Dimethylamino-2-naphthalen-2-yl-1-phenyl...)
Affinity DataKi:  15nM. Assay description: Inhibition of [3H]- NE reuptake into rat hippocampal synaptosomes
In DepthDetails ArticlePubMed
TargetSodium-dependent noradrenaline transporter(Homo sapiens (Human))
Hong Kong University Of Science And Technology
Curated by ChEMBL
LigandPNGBDBM50069453((1R,2R)-3-Dimethylamino-2-naphthalen-2-yl-1-phenyl...)
Affinity DataKd:  44nM. Assay description: Equilibrium dissociation constant (KD) for Competitive binding between [3H]- nisoxatine and the compound at human Norepinephrine transporter
In DepthDetails ArticlePubMed
TargetSodium-dependent dopamine transporter(Homo sapiens (Human))
Hong Kong University Of Science And Technology
Curated by ChEMBL
LigandPNGBDBM50069453((1R,2R)-3-Dimethylamino-2-naphthalen-2-yl-1-phenyl...)
Affinity DataKd:  70nM. Assay description: Equilibrium dissociation constant (KD) for Competitive binding between [3H]WIN-35428 and the compound at human transporter-hDAT
In DepthDetails ArticlePubMed
TargetSodium-dependent serotonin transporter(Homo sapiens (Human))
Hong Kong University Of Science And Technology
Curated by ChEMBL
LigandPNGBDBM50069453((1R,2R)-3-Dimethylamino-2-naphthalen-2-yl-1-phenyl...)
Affinity DataKd:  5.60nM. Assay description: Equilibrium dissociation constant (KD) for Competitive binding between [3H]- imipramine and the compound at human transporter-hSERT
In DepthDetails ArticlePubMed