BDBM50069489 (7-Bromo-2,3-dioxo-1,2,3,4-tetrahydro-quinoxalin-5-ylmethyl)-carbamic acid phenyl ester::CHEMBL148200
SMILES Brc1cc(CNC(=O)Oc2ccccc2)c2[nH]c(=O)c(=O)[nH]c2c1
InChI Key InChIKey=PRCDIIHWVPATCV-UHFFFAOYSA-N
Data  1 IC50
  Tab Delimited (TSV)   2D SDfile   Computed 3D by Vconf -m prep SDfile
Find this compound or compounds like it in BindingDB:
Activity Spreadsheet -- Enzyme Inhibition Constant Data from BindingDB
Found 1 hit for monomerid = 50069489
TargetGlutamate receptor ionotropic, NMDA 1(RAT)
Novartis Pharma
Curated by ChEMBL
LigandPNGBDBM50069489((7-Bromo-2,3-dioxo-1,2,3,4-tetrahydro-quinoxalin-5...)
Affinity DataIC50:  1.50E+3nM. Assay description: In vitro binding assay for the displacement of [3H]MDL-105519 from the glycine-site of NMDA receptors
In DepthDetails ArticlePubMed