BDBM50069910 4-(4-Benzyl-piperazin-1-yl)-phenol::CHEMBL103900
SMILES Oc1ccc(cc1)N1CCN(Cc2ccccc2)CC1
InChI Key InChIKey=MKDLAVWJHBTGFQ-UHFFFAOYSA-N
Data  4 KI
  Tab Delimited (TSV)   2D SDfile   Computed 3D by Vconf -m prep SDfile
Find this compound or compounds like it in BindingDB:
Activity Spreadsheet -- Enzyme Inhibition Constant Data from BindingDB
Found 4 hits for monomerid = 50069910
TargetD(4) dopamine receptor(Homo sapiens (Human))
Wyeth-Ayerst Research Laboratories
Curated by ChEMBL
LigandPNGBDBM50069910(4-(4-Benzyl-piperazin-1-yl)-phenol | CHEMBL103900)
Affinity DataKi:  92nM. Assay description: Binding affinity towards human cloned Dopamine receptor D4.4 expressed in CHO cells using [3H]-spiperone as radioligand
In DepthDetails ArticlePubMed
TargetD(2) dopamine receptor(Rattus norvegicus (rat))
Wyeth-Ayerst Research Laboratories
Curated by ChEMBL
LigandPNGBDBM50069910(4-(4-Benzyl-piperazin-1-yl)-phenol | CHEMBL103900)
Affinity DataKi:  120nM. Assay description: Agonistic activity towards dopamine D2 receptor using radioligand [3H]-quinpirole in rat striatal membranes
In DepthDetails ArticlePubMed
TargetD(2) dopamine receptor(Homo sapiens (Human))
Wyeth-Ayerst Research Laboratories
Curated by ChEMBL
LigandPNGBDBM50069910(4-(4-Benzyl-piperazin-1-yl)-phenol | CHEMBL103900)
Affinity DataKi: >300nM. Assay description: Binding affinity towards human cloned dopamine (hD2s) receptors expressed in CHO cell membranes using [3H]-spiperone
In DepthDetails ArticlePubMed
TargetD(3) dopamine receptor(Homo sapiens (Human))
Wyeth-Ayerst Research Laboratories
Curated by ChEMBL
LigandPNGBDBM50069910(4-(4-Benzyl-piperazin-1-yl)-phenol | CHEMBL103900)
Affinity DataKi: >400nM. Assay description: Binding affinity towards human cloned dopamine (hD3) receptor expressed in CHO cells using [3H]-spiperone as radioligand
In DepthDetails ArticlePubMed