BDBM50069916 2-(4-Benzyl-piperazin-1-yl)-phenol::CHEMBL100952
SMILES Oc1ccccc1N1CCN(Cc2ccccc2)CC1
InChI Key InChIKey=FPVKDWNGSLXDRY-UHFFFAOYSA-N
Data  5 KI
  Tab Delimited (TSV)   2D SDfile   Computed 3D by Vconf -m prep SDfile
Find this compound or compounds like it in BindingDB:
Activity Spreadsheet -- Enzyme Inhibition Constant Data from BindingDB
Found 5 hits for monomerid = 50069916
TargetD(2) dopamine receptor(Rattus norvegicus (rat))
Wyeth-Ayerst Research Laboratories
Curated by ChEMBL
LigandPNGBDBM50069916(2-(4-Benzyl-piperazin-1-yl)-phenol | CHEMBL100952)
Affinity DataKi:  65nM. Assay description: Antagonistic activity towards dopamine D2 receptor using radioligand [3H]-spiperone in rat striatal membranes
In DepthDetails ArticlePubMed
TargetD(2) dopamine receptor(Rattus norvegicus (rat))
Wyeth-Ayerst Research Laboratories
Curated by ChEMBL
LigandPNGBDBM50069916(2-(4-Benzyl-piperazin-1-yl)-phenol | CHEMBL100952)
Affinity DataKi:  118nM. Assay description: Antagonistic activity towards dopamine D2 receptor using radioligand [3H]-spiperone in rat striatal membranes
In DepthDetails ArticlePubMed
TargetD(2) dopamine receptor(Homo sapiens (Human))
Wyeth-Ayerst Research Laboratories
Curated by ChEMBL
LigandPNGBDBM50069916(2-(4-Benzyl-piperazin-1-yl)-phenol | CHEMBL100952)
Affinity DataKi: >300nM. Assay description: Binding affinity towards human cloned dopamine (hD2s) receptors expressed in CHO cell membranes using [3H]-spiperone
In DepthDetails ArticlePubMed
TargetD(3) dopamine receptor(Homo sapiens (Human))
Wyeth-Ayerst Research Laboratories
Curated by ChEMBL
LigandPNGBDBM50069916(2-(4-Benzyl-piperazin-1-yl)-phenol | CHEMBL100952)
Affinity DataKi: >400nM. Assay description: Binding affinity towards human cloned dopamine (hD3) receptor expressed in CHO cells using [3H]-spiperone as radioligand
In DepthDetails ArticlePubMed
TargetD(4) dopamine receptor(Homo sapiens (Human))
Wyeth-Ayerst Research Laboratories
Curated by ChEMBL
LigandPNGBDBM50069916(2-(4-Benzyl-piperazin-1-yl)-phenol | CHEMBL100952)
Affinity DataKi: >400nM. Assay description: Binding affinity towards human cloned Dopamine receptor D4.4 expressed in CHO cells using [3H]-spiperone as radioligand
In DepthDetails ArticlePubMed