BDBM50070068 CHEMBL3407805::US9878996, Compound 2
SMILES Fc1cccc(CCN2CCN(CC2)c2ccnc(n2)-n2ccnc2)c1
InChI Key InChIKey=OAOKVKSLVMZWAW-UHFFFAOYSA-N
Data  2 KI
  Tab Delimited (TSV)   2D SDfile   Computed 3D by Vconf -m prep SDfile
Find this compound or compounds like it in BindingDB:
Activity Spreadsheet -- Enzyme Inhibition Constant Data from BindingDB
Found 2 hits for monomerid = 50070068
TargetNitric oxide synthase, brain(Rattus norvegicus (rat))
Northwestern University
US Patent
LigandPNGBDBM50070068(CHEMBL3407805 | US9878996, Compound 2)
Affinity DataKi:  4.70E+3nM. Assay description: Assays were performed at the NIMH Psychoactive Drug Screening Program (PDSP) at UNC-Chapel Hill.
In DepthDetails US Patent
TargetNitric oxide synthase, brain(Rattus norvegicus (rat))
Northwestern University
US Patent
LigandPNGBDBM50070068(CHEMBL3407805 | US9878996, Compound 2)
Affinity DataKi:  4.70E+3nM. Assay description: Binding affinity to recombinant rat neuronal NOS overexpressed in Escherichia coli assessed as production of nitric oxide from L-arginine measured fo...
In DepthDetails ArticlePubMed