BDBM50070071 CHEMBL3407833
SMILES Cl.NC(=N)Nc1cnc2CCCCc2c1
InChI Key InChIKey=OKARPRUVRCNIIG-UHFFFAOYSA-N
Data  1 KI
  Tab Delimited (TSV)   2D SDfile   Computed 3D by Vconf -m prep SDfile
Find this compound or compounds like it in BindingDB:
Activity Spreadsheet -- Enzyme Inhibition Constant Data from BindingDB
Found 1 hit for monomerid = 50070071
TargetAlpha-2A/Alpha-2B/Alpha-2C adrenergic receptor(Homo sapiens (Human))
Trinity College
Curated by ChEMBL
LigandPNGBDBM50070071(CHEMBL3407833)
Affinity DataKi:  2.69E+3nM. Assay description: Displacement of [3H]-RX-821002 from human alpha-2 adrenergic receptor in brain prefrontal cortex membrane by liquid scintillation spectrometry
In DepthDetails ArticlePubMed