BDBM50070245 2-Ethylamino-4-methyl-pentanoic acid {(S)-2-[2-(1-hydroxy-2-mercapto-ethyl)-5-phenyl-pentanoylamino]-4-methyl-pentanoyl}-amide::CHEMBL273762
SMILES CCNC(CC(C)C)C(=O)NC(=O)[C@H](CC(C)C)NC(=O)C(CCCc1ccccc1)C(O)CS
InChI Key InChIKey=BKQXMGZHHHUCEX-KHEPKPQXSA-N
Data  1 IC50
  Tab Delimited (TSV)   2D SDfile   Computed 3D by Vconf -m prep SDfile
Find this compound or compounds like it in BindingDB:
Activity Spreadsheet -- Enzyme Inhibition Constant Data from BindingDB
Found 1 hit for monomerid = 50070245
TargetStromelysin-1(Homo sapiens (Human))
Affymax Research Institute
Curated by ChEMBL
LigandPNGBDBM50070245(2-Ethylamino-4-methyl-pentanoic acid {(S)-2-[2-(1-...)
Affinity DataIC50:  140nM. Assay description: In vitro inhibitory activity against stromelysin-3 (MMP-3)
In DepthDetails ArticlePubMed