BDBM50070339 4-Bromo-thiophene-2-sulfonic acid [2-(3-{[((E)-6,6-dimethyl-hept-2-en-4-ynyl)-ethyl-amino]-methyl}-phenoxy)-ethyl]-methyl-amide::CHEMBL25755
SMILES CCN(C\C=C\C#CC(C)(C)C)Cc1cccc(OCCN(C)S(=O)(=O)c2cc(Br)cs2)c1
InChI Key InChIKey=IOKUPDFFGGHLDB-VQHVLOKHSA-N
Data  1 IC50
  Tab Delimited (TSV)   2D SDfile   Computed 3D by Vconf -m prep SDfile
Find this compound or compounds like it in BindingDB:
Activity Spreadsheet -- Enzyme Inhibition Constant Data from BindingDB
Found 1 hit for monomerid = 50070339
TargetSqualene monooxygenase(Homo sapiens (Human))
Centre De Recherche Pierre Fabre
Curated by ChEMBL
LigandPNGBDBM50070339(4-Bromo-thiophene-2-sulfonic acid [2-(3-{[((E)-6,6...)
Affinity DataIC50:  300nM. Assay description: In vitro inhibition of cholesterol biosynthesis in human HepG2 cells.
In DepthDetails ArticlePubMed