BDBM50070345 CHEMBL26964::Thiophene-2-sulfonic acid [2-(3-{[((E)-6,6-dimethyl-hept-2-en-4-ynyl)-ethyl-amino]-methyl}-phenoxy)-ethyl]-propyl-amide
SMILES CCCN(CCOc1cccc(CN(CC)C\C=C\C#CC(C)(C)C)c1)S(=O)(=O)c1cccs1
InChI Key InChIKey=MYKWNGXCGIAQPE-CSKARUKUSA-N
Data  1 IC50
  Tab Delimited (TSV)   2D SDfile   Computed 3D by Vconf -m prep SDfile
Find this compound or compounds like it in BindingDB:
Activity Spreadsheet -- Enzyme Inhibition Constant Data from BindingDB
Found 1 hit for monomerid = 50070345
TargetSqualene monooxygenase(Homo sapiens (Human))
Centre De Recherche Pierre Fabre
Curated by ChEMBL
LigandPNGBDBM50070345(CHEMBL26964 | Thiophene-2-sulfonic acid [2-(3-{[((...)
Affinity DataIC50:  170nM. Assay description: In vitro inhibition of cholesterol biosynthesis in human HepG2 cells.
In DepthDetails ArticlePubMed