BDBM50070357 CHEMBL288139
SMILES CC1CC(NC(C2CC2)C2CC2)=NC1C
InChI Key InChIKey=MMBBLZBWERBHTI-UHFFFAOYSA-N
Data  4 KI
  Tab Delimited (TSV)   2D SDfile   Computed 3D by Vconf -m prep SDfile
Find this compound or compounds like it in BindingDB:
Activity Spreadsheet -- Enzyme Inhibition Constant Data from BindingDB
Found 4 hits for monomerid = 50070357
TargetNischarin(RAT)
Universit£
Curated by ChEMBL
LigandPNGBDBM50070357(CHEMBL288139)
Affinity DataKi:  537nM. Assay description: Displacement of [125I] PIC from I1 imidazoline receptor in rat PC12 cells after 45 mins by gamma counting
In DepthDetails ArticlePubMed
TargetNischarin(Homo sapiens (Human))
Universit£
Curated by ChEMBL
LigandPNGBDBM50070357(CHEMBL288139)
Affinity DataKi:  537nM. Assay description: Displacement of [3H]clonidine from imidazoline receptor I-1 of bovine chromaffin cell membranes
In DepthDetails ArticlePubMed
TargetAmine oxidase [flavin-containing] A/B(Homo sapiens (Human))
Universit£
Curated by ChEMBL
LigandPNGBDBM50070357(CHEMBL288139)
Affinity DataKi: <1.00E+4nM. Assay description: Displacement of [3H]idazoxan from I2 imidazoline binding sites (I2Bs) of rabbit renal cortex membranes
In DepthDetails ArticlePubMed
TargetAlpha-2A/Alpha-2B/Alpha-2C adrenergic receptor(Homo sapiens (Human))
Universit£
Curated by ChEMBL
LigandPNGBDBM50070357(CHEMBL288139)
Affinity DataKi: >1.00E+4nM. Assay description: Displacement of [3H]RX821002 from human alpha2 adrenoceptor expressed in CHO cell membranes after 60 mins
In DepthDetails ArticlePubMed