BDBM50070529 CHEMBL3408803
SMILES Nc1ncnc2c3cc(cnc3sc12)-c1ccc(F)cc1Cl
InChI Key InChIKey=RDQLUYGIOULCSF-UHFFFAOYSA-N
Data  2 IC50
  Tab Delimited (TSV)   2D SDfile   Computed 3D by Vconf -m prep SDfile
Find this compound or compounds like it in BindingDB:
Activity Spreadsheet -- Enzyme Inhibition Constant Data from BindingDB
Found 2 hits for monomerid = 50070529
TargetDual specificity protein kinase CLK1(Homo sapiens (Human))
Cobra
Curated by ChEMBL
LigandPNGBDBM50070529(CHEMBL3408803)
Affinity DataIC50:  190nM. Assay description: Inhibition of human recombinant GST-tagged CLK1 expressed in Escherichia coli using GRSRSRSRSRSR as substrate after 30 mins
In DepthDetails ArticlePubMed
LigandPNGBDBM50070529(CHEMBL3408803)
Affinity DataIC50:  330nM. Assay description: Inhibition of rat recombinant GST-tagged DYRK1A expressed in Escherichia coli using KKISGRLSPIMTEQ as substrate after 30 mins by scintillation counti...
In DepthDetails ArticlePubMed