BDBM50070636 (S)-3-Amino-tetrahydro-thiophene-3-carboxylic acid::CHEMBL297167
SMILES N[C@@]1(CCSC1)C(O)=O
InChI Key InChIKey=SAKWWHXZZFRWCN-RXMQYKEDSA-N
Data  1 KI
  Tab Delimited (TSV)   2D SDfile   Computed 3D by Vconf -m prep SDfile
Find this compound or compounds like it in BindingDB:
Activity Spreadsheet -- Enzyme Inhibition Constant Data from BindingDB
Found 1 hit for monomerid = 50070636
TargetS-adenosylmethionine synthase isoform type-1(Rattus norvegicus)
Umr 6519
Curated by ChEMBL
LigandPNGBDBM50070636((S)-3-Amino-tetrahydro-thiophene-3-carboxylic acid...)
Affinity DataKi:  1.04E+6nM. Assay description: Compound was evaluated for its inhibitory activity against recombinant S-adenosyl L-Methionine synthetase (alpha-isoform) in rat liver
In DepthDetails ArticlePubMed