BDBM50070910 CHEMBL3409534
SMILES [Li+].[Li+].CC[C@H](NC(=O)[C@H](C)NP([O-])(=O)CNC(=O)OCc1ccccc1)C([O-])=O
InChI Key InChIKey=PZICBAWVFGJHPK-JBUFHSOLSA-L
Data  1 KI
  Tab Delimited (TSV)   2D SDfile   Computed 3D by Vconf -m prep SDfile
Find this compound or compounds like it in BindingDB:
Activity Spreadsheet -- Enzyme Inhibition Constant Data from BindingDB
Found 1 hit for monomerid = 50070910
TargetThermolysin(Bacillus thermoproteolyticus)
The State University Of New York
Curated by ChEMBL
LigandPNGBDBM50070910(CHEMBL3409534)
Affinity DataKi:  1.37E+3nM. Assay description: Inhibition of Bacillus thermoproteolyticus TLN using 2-furanacryloyl-Gly-Leu-NH2 substrate by biochemical assay
In DepthDetails ArticlePubMed