BDBM50070943 CHEMBL3409505
SMILES [Li+].CCC[C@H](NP([O-])(=O)CNC(=O)OCc1ccccc1)C(=O)NCCC(C)C
InChI Key InChIKey=FBKBABCYANPDDH-KRWDZBQOSA-M
Data  1 KI
  Tab Delimited (TSV)   2D SDfile   Computed 3D by Vconf -m prep SDfile
Find this compound or compounds like it in BindingDB:
Activity Spreadsheet -- Enzyme Inhibition Constant Data from BindingDB
Found 1 hit for monomerid = 50070943
TargetThermolysin(Bacillus thermoproteolyticus)
The State University Of New York
Curated by ChEMBL
LigandPNGBDBM50070943(CHEMBL3409505)
Affinity DataKi:  219nM. Assay description: Inhibition of Bacillus thermoproteolyticus TLN using 2-furanacryloyl-Gly-Leu-NH2 substrate by biochemical assay
In DepthDetails ArticlePubMed