BDBM50071207 2-(4-Dibenzofuran-4-ylmethyl-piperazin-1-yl)-pyrimidine::CHEMBL64622
SMILES C(N1CCN(CC1)c1ncccn1)c1cccc2c3ccccc3oc12
InChI Key InChIKey=VXKQWPOVAUPAIV-UHFFFAOYSA-N
Data  2 IC50
  Tab Delimited (TSV)   2D SDfile   Computed 3D by Vconf -m prep SDfile
Find this compound or compounds like it in BindingDB:
Activity Spreadsheet -- Enzyme Inhibition Constant Data from BindingDB
Found 2 hits for monomerid = 50071207
TargetD(4) dopamine receptor(Homo sapiens (Human))
Darmstadt
Curated by ChEMBL
LigandPNGBDBM50071207(2-(4-Dibenzofuran-4-ylmethyl-piperazin-1-yl)-pyrim...)
Affinity DataIC50:  290nM. Assay description: Binding affinity to cloned human Dopamine receptor D4 expressed in CHO cells using [3H]spiperone
In DepthDetails ArticlePubMed
Target5-hydroxytryptamine receptor 1A(Rattus norvegicus (rat))
Darmstadt
Curated by ChEMBL
LigandPNGBDBM50071207(2-(4-Dibenzofuran-4-ylmethyl-piperazin-1-yl)-pyrim...)
Affinity DataIC50: >100nM. Assay description: Binding affinity to 5-HT1A receptor in rat hippocampus by [3H]8-OH-DPAT displacement.
In DepthDetails ArticlePubMed