BDBM50071236 3-(2,4-Dichloro-phenyl)-2,5-dimethyl-7-morpholin-4-yl-pyrazolo[1,5-a]pyrimidine::CHEMBL65308
SMILES Cc1nn2c(cc(C)nc2c1-c1ccc(Cl)cc1Cl)N1CCOCC1
InChI Key InChIKey=VEYICMVGAGTXTM-UHFFFAOYSA-N
Data  1 KI
  Tab Delimited (TSV)   2D SDfile   Computed 3D by Vconf -m prep SDfile
Find this compound or compounds like it in BindingDB:
Activity Spreadsheet -- Enzyme Inhibition Constant Data from BindingDB
Found 1 hit for monomerid = 50071236
TargetCorticotropin-releasing factor receptor 1(Homo sapiens (Human))
Warner-Lambert
Curated by ChEMBL
LigandPNGBDBM50071236(3-(2,4-Dichloro-phenyl)-2,5-dimethyl-7-morpholin-4...)
Affinity DataKi:  310nM. Assay description: Displacement of [125I]-0-CRF from human Corticotropin releasing factor receptor 1 expressed in CHO cells
In DepthDetails ArticlePubMed