BDBM50071256 CHEMBL417574::{(S)-3-[(R)-2-((R)-1-Hydroxycarbamoyl-ethyl)-4-methyl-pentanoylamino]-2-oxo-azepan-1-yl}-acetic acid methyl ester
SMILES COC(=O)CN1CCCC[C@H](NC(=O)[C@H](CC(C)C)[C@@H](C)C(=O)NO)C1=O
InChI Key InChIKey=MOBAWCSMNMHMJW-MCIONIFRSA-N
Data  2 IC50
  Tab Delimited (TSV)   2D SDfile   Computed 3D by Vconf -m prep SDfile
Find this compound or compounds like it in BindingDB:
Activity Spreadsheet -- Enzyme Inhibition Constant Data from BindingDB
Found 2 hits for monomerid = 50071256
TargetInterstitial collagenase(Homo sapiens (Human))
Procter And Gamble Pharmaceuticals
Curated by ChEMBL
LigandPNGBDBM50071256(CHEMBL417574 | {(S)-3-[(R)-2-((R)-1-Hydroxycarbamo...)
Affinity DataIC50:  49nM. Assay description: Inhibition of matrix metalloproteinase-1 (MMP-1)
In DepthDetails ArticlePubMed
TargetStromelysin-1(Homo sapiens (Human))
Procter And Gamble Pharmaceuticals
Curated by ChEMBL
LigandPNGBDBM50071256(CHEMBL417574 | {(S)-3-[(R)-2-((R)-1-Hydroxycarbamo...)
Affinity DataIC50:  215nM. Assay description: Inhibition of matrix metalloproteinase-3 (MMP-3)
In DepthDetails ArticlePubMed