BDBM50071311 4,5-Dimethoxy-6-(2-methylamino-thiazol-4-yl)-pyridine-2-carboxylic acid::CHEMBL432917
SMILES CNc1nc(cs1)-c1nc(cc(OC)c1OC)C(O)=O
InChI Key InChIKey=HHPFHJBVFRWRMW-UHFFFAOYSA-N
Data  1 IC50
  Tab Delimited (TSV)   2D SDfile   Computed 3D by Vconf -m prep SDfile
Find this compound or compounds like it in BindingDB:
Activity Spreadsheet -- Enzyme Inhibition Constant Data from BindingDB
Found 1 hit for monomerid = 50071311
TargetEndothelin-converting enzyme 1(Homo sapiens (Human))
Warner-Lambert
Curated by ChEMBL
LigandPNGBDBM50071311(4,5-Dimethoxy-6-(2-methylamino-thiazol-4-yl)-pyrid...)
Affinity DataIC50:  2.60E+3nM. Assay description: Inhibition of human recombinant Endothelin-converting enzyme 1.
In DepthDetails ArticlePubMed