BDBM50071315 5-Methoxy-6-(2-methyl-thiazol-4-yl)-pyridine-2-carboxylic acid::CHEMBL66969
SMILES COc1ccc(nc1-c1csc(C)n1)C(O)=O
InChI Key InChIKey=XBVSAEKXGQRCLQ-UHFFFAOYSA-N
Data  1 IC50
  Tab Delimited (TSV)   2D SDfile   Computed 3D by Vconf -m prep SDfile
Find this compound or compounds like it in BindingDB:
Activity Spreadsheet -- Enzyme Inhibition Constant Data from BindingDB
Found 1 hit for monomerid = 50071315
TargetEndothelin-converting enzyme 1(Homo sapiens (Human))
Warner-Lambert
Curated by ChEMBL
LigandPNGBDBM50071315(5-Methoxy-6-(2-methyl-thiazol-4-yl)-pyridine-2-car...)
Affinity DataIC50:  1.40E+3nM. Assay description: Inhibition of human recombinant Endothelin-converting enzyme 1.
In DepthDetails ArticlePubMed