BDBM50071318 (1R,3S,5R)-2-((S)-3-Mercapto-2-methyl-propionyl)-2-aza-bicyclo[3.1.0]hexane-3-carboxylic acid::CHEMBL66217
SMILES C[C@H](CS)C(=O)N1[C@@H]2C[C@@H]2C[C@H]1C(O)=O
InChI Key InChIKey=AFFACDSDWPAZOM-XUTVFYLZSA-N
Data  1 IC50
  Tab Delimited (TSV)   2D SDfile   Computed 3D by Vconf -m prep SDfile
Find this compound or compounds like it in BindingDB:
Activity Spreadsheet -- Enzyme Inhibition Constant Data from BindingDB
Found 1 hit for monomerid = 50071318
TargetAngiotensin-converting enzyme(Oryctolagus cuniculus)
Universit£
Curated by ChEMBL
LigandPNGBDBM50071318((1R,3S,5R)-2-((S)-3-Mercapto-2-methyl-propionyl)-2...)
Affinity DataIC50:  7.60nM. Assay description: Compound was tested for its inhibitory activity against Angiotensin I converting enzyme
In DepthDetails ArticlePubMed