BDBM50071345 4-Chloro-N-[3-(1H-imidazol-4-yl)-propyl]-benzenesulfonamide::CHEMBL69552
SMILES Clc1ccc(cc1)S(=O)(=O)NCCCc1cnc[nH]1
InChI Key InChIKey=XBEUSFPSRIERDA-UHFFFAOYSA-N
Data  1 KI
  Tab Delimited (TSV)   2D SDfile   Computed 3D by Vconf -m prep SDfile
Find this compound or compounds like it in BindingDB:
Activity Spreadsheet -- Enzyme Inhibition Constant Data from BindingDB
Found 1 hit for monomerid = 50071345
TargetHistamine H3 receptor(GUINEA PIG)
Schering-Plough Research Institute
Curated by ChEMBL
LigandPNGBDBM50071345(4-Chloro-N-[3-(1H-imidazol-4-yl)-propyl]-benzenesu...)
Affinity DataKi:  380nM. Assay description: Inhibition of [3H]-Nalpha-methylhistamine binding to H3 receptor in guinea-pig brain membranes
In DepthDetails ArticlePubMed