BDBM50071394 5-Cyclopropyl-isoxazole-4-carbothioic acid (4-trifluoromethyl-phenyl)-amide::CHEMBL70708
SMILES FC(F)(F)c1ccc(NC(=S)c2cnoc2C2CC2)cc1
InChI Key InChIKey=NIFLXVUORSUDQV-UHFFFAOYSA-N
Data  1 IC50
  Tab Delimited (TSV)   2D SDfile   Computed 3D by Vconf -m prep SDfile
Find this compound or compounds like it in BindingDB:
Activity Spreadsheet -- Enzyme Inhibition Constant Data from BindingDB
Found 1 hit for monomerid = 50071394
TargetDihydroorotate dehydrogenase (quinone), mitochondrial(Homo sapiens (Human))
Novartis Pharma
Curated by ChEMBL
LigandPNGBDBM50071394(5-Cyclopropyl-isoxazole-4-carbothioic acid (4-trif...)
Affinity DataIC50:  3.20E+3nM. Assay description: Immunosuppressive activity of the compound expressed as ability to inhibit human recombinant dihydroorotate dehydrogenase (DHODH)
In DepthDetails ArticlePubMed