BDBM50071395 5-Methyl-isoxazole-4-carbothioic acid (4-trifluoromethyl-phenyl)-amide::CHEMBL69131
SMILES Cc1oncc1C(=S)Nc1ccc(cc1)C(F)(F)F
InChI Key InChIKey=PTQSXXWCFKPULH-UHFFFAOYSA-N
Data  1 IC50
  Tab Delimited (TSV)   2D SDfile   Computed 3D by Vconf -m prep SDfile
Find this compound or compounds like it in BindingDB:
Activity Spreadsheet -- Enzyme Inhibition Constant Data from BindingDB
Found 1 hit for monomerid = 50071395
TargetDihydroorotate dehydrogenase (quinone), mitochondrial(Homo sapiens (Human))
Novartis Pharma
Curated by ChEMBL
LigandPNGBDBM50071395(5-Methyl-isoxazole-4-carbothioic acid (4-trifluoro...)
Affinity DataIC50: >5.00E+4nM. Assay description: Immunosuppressive activity of the compound expressed as ability to inhibit human recombinant dihydroorotate dehydrogenase (DHODH)
In DepthDetails ArticlePubMed