BDBM50071565 2-(2,2-Diphenyl-ethyl)-7-methyl-1,3-dioxo-2,3,5,8-tetrahydro-1H-[1,2,4]triazolo[1,2-a]pyridazine-5-carboxylic acid {5-amino-1-[2-(4-carbamoyl-phenyl)-ethylaminooxalyl]-pentyl}-amide::CHEMBL306797
SMILES CC1=CC(C(=O)NC(CCCCN)C(=O)C(=O)NCCc2ccc(cc2)C(N)=O)n2n(C1)c(=O)n(CC(c1ccccc1)c1ccccc1)c2=O
InChI Key InChIKey=GDXSOPXPZLEHAW-UHFFFAOYSA-N
Data  1 KI
  Tab Delimited (TSV)   2D SDfile   Computed 3D by Vconf -m prep SDfile
Find this compound or compounds like it in BindingDB:
Activity Spreadsheet -- Enzyme Inhibition Constant Data from BindingDB
Found 1 hit for monomerid = 50071565
TargetProthrombin(Homo sapiens (Human))
Molecumetics
Curated by ChEMBL
LigandPNGBDBM50071565(2-(2,2-Diphenyl-ethyl)-7-methyl-1,3-dioxo-2,3,5,8-...)
Affinity DataKi:  0.0350nM. Assay description: Compound was evaluated for its binding affinity to the thrombin
In DepthDetails ArticlePubMed