BDBM50071679 5-Amino-2-[1-(3,5-dibromo-4-hydroxy-phenyl)-meth-(E)-ylidene]-indan-1-one::CHEMBL86228
SMILES Nc1ccc2C(=O)\C(Cc2c1)=C\c1cc(Br)c(O)c(Br)c1
InChI Key InChIKey=DFOPHYSZHMXEGI-XCVCLJGOSA-N
Data  1 IC50
  Tab Delimited (TSV)   2D SDfile   Computed 3D by Vconf -m prep SDfile
Find this compound or compounds like it in BindingDB:
Activity Spreadsheet -- Enzyme Inhibition Constant Data from BindingDB
Found 1 hit for monomerid = 50071679
TargetTyrosine-protein kinase Lck(Homo sapiens (Human))
R. W. Johnson Pharmaceutical Research Institute
Curated by ChEMBL
LigandPNGBDBM50071679(5-Amino-2-[1-(3,5-dibromo-4-hydroxy-phenyl)-meth-(...)
Affinity DataIC50:  5.00E+3nM. Assay description: Inhibition of p56 Lck tyrosine kinase
In DepthDetails ArticlePubMed