BDBM50071787 CHEMBL3410577
SMILES CC(=O)c1sc(Nc2ccc3cc4ccccc4cc3c2)nc1C
InChI Key InChIKey=WJJLWCJQTNHVMW-UHFFFAOYSA-N
Data  1 IC50
  Tab Delimited (TSV)   2D SDfile   Computed 3D by Vconf -m prep SDfile
Find this compound or compounds like it in BindingDB:
Activity Spreadsheet -- Enzyme Inhibition Constant Data from BindingDB
Found 1 hit for monomerid = 50071787
TargetDihydroorotate dehydrogenase (quinone), mitochondrial(Homo sapiens (Human))
East China University Of Science And Techology
Curated by ChEMBL
LigandPNGBDBM50071787(CHEMBL3410577)
Affinity DataIC50: >1.00E+4nM. Assay description: Inhibition of human DHODH using dihydroorotate substrate by DCIP assay
In DepthDetails ArticlePubMed