BDBM50071820 CHEMBL3410871
SMILES CN[C@@H](C)C(=O)N[C@H](C(=O)N1C[C@H](C[C@H]1C(=O)N[C@@H]1CCCc2ccccc12)NC(=O)C1(CCC1)C(=O)Nc1ccc2C[C@H](N(Cc2c1)C(=O)[C@@H](NC(=O)[C@H](C)NC)C(C)(C)C)C(=O)N[C@@H]1CCCc2ccccc12)C(C)(C)C
InChI Key InChIKey=OMVBPXMCVLZSMI-PRXWBPHPSA-N
Data  1 IC50
  Tab Delimited (TSV)   2D SDfile   Computed 3D by Vconf -m prep SDfile
Find this compound or compounds like it in BindingDB:
Activity Spreadsheet -- Enzyme Inhibition Constant Data from BindingDB
Found 1 hit for monomerid = 50071820
TargetBaculoviral IAP repeat-containing protein 2(Homo sapiens (Human))
Bristol-Myers Squibb Research
Curated by ChEMBL
LigandPNGBDBM50071820(CHEMBL3410871)
Affinity DataIC50:  4nM. Assay description: Binding affinity to human N-terminal His-tagged cIAP1 BIR2-3 C202A/C213G mutant after 60 mins by HTRF assay
In DepthDetails ArticlePubMed