BDBM50071903 4-[5-(4-Nitro-phenyl)-2-phenyl-1H-pyrrol-3-yl]-pyridine::CHEMBL312942
SMILES [O-][N+](=O)c1ccc(cc1)-c1cc(c([nH]1)-c1ccccc1)-c1ccncc1
InChI Key InChIKey=HKDMFCFZBNJOPS-UHFFFAOYSA-N
Data  1 IC50
  Tab Delimited (TSV)   2D SDfile   Computed 3D by Vconf -m prep SDfile
Find this compound or compounds like it in BindingDB:
Activity Spreadsheet -- Enzyme Inhibition Constant Data from BindingDB
Found 1 hit for monomerid = 50071903
TargetMitogen-activated protein kinase 14(Rattus norvegicus)
Merck Research Laboratory
Curated by ChEMBL
LigandPNGBDBM50071903(4-[5-(4-Nitro-phenyl)-2-phenyl-1H-pyrrol-3-yl]-pyr...)
Affinity DataIC50:  6.10nM. Assay description: Inhibitory potency evaluated against rat p38 kinase
In DepthDetails ArticlePubMed