BDBM50072191 1,2,5,6-Tetrahydro-pyrido[1,2-a]quinolin-3-one::1,2,5,6-tetrahydro pyrido[1,2-a]quinolin-3-one::CHEMBL96006
SMILES O=C1CCN2C(CCc3ccccc23)=C1
InChI Key InChIKey=OPJKPSOLCGGXEW-UHFFFAOYSA-N
Data  4 IC50
  Tab Delimited (TSV)   2D SDfile   Computed 3D by Vconf -m prep SDfile
Find this compound or compounds like it in BindingDB:
Activity Spreadsheet -- Enzyme Inhibition Constant Data from BindingDB
Found 4 hits for monomerid = 50072191
Target3-oxo-5-alpha-steroid 4-dehydrogenase 1(Homo sapiens (Human))
Università
Curated by ChEMBL
LigandPNGBDBM50072191(1,2,5,6-Tetrahydro-pyrido[1,2-a]quinolin-3-one | 1...)
Affinity DataIC50:  298nM. Assay description: Inhibition of human Steroid 5-alpha-reductase type I
In DepthDetails ArticlePubMed
Target3-oxo-5-alpha-steroid 4-dehydrogenase 1(Homo sapiens (Human))
Università
Curated by ChEMBL
LigandPNGBDBM50072191(1,2,5,6-Tetrahydro-pyrido[1,2-a]quinolin-3-one | 1...)
Affinity DataIC50:  298nM. Assay description: Inhibition of recombinant steroid 5-alpha-reductase type I expressed in CHO cells
In DepthDetails ArticlePubMed
Target3-oxo-5-alpha-steroid 4-dehydrogenase 1(Homo sapiens (Human))
Università
Curated by ChEMBL
LigandPNGBDBM50072191(1,2,5,6-Tetrahydro-pyrido[1,2-a]quinolin-3-one | 1...)
Affinity DataIC50:  298nM. Assay description: Compound was evaluated for the inhibition of human Steroid 5-alpha-reductase type 1 from recombinant CHO cells
In DepthDetails ArticlePubMed
Target3-oxo-5-alpha-steroid 4-dehydrogenase 1(Homo sapiens (Human))
Università
Curated by ChEMBL
LigandPNGBDBM50072191(1,2,5,6-Tetrahydro-pyrido[1,2-a]quinolin-3-one | 1...)
Affinity DataIC50:  298nM. Assay description: Inhibitory concentration against human recombinant steroid 5-alpha-reductase type I in stably transfected chinese hamster ovary (CHO) 1827 cells usin...
In DepthDetails ArticlePubMed