BDBM50072221 CHEMBL3408337
SMILES CCn1c2ccc(cc2n(CC)c1=O)C(=O)c1c(C)nn(C)c1O
InChI Key InChIKey=HTIRQTJYYQHESU-UHFFFAOYSA-N
Data  1 IC50
  Tab Delimited (TSV)   2D SDfile   Computed 3D by Vconf -m prep SDfile
Find this compound or compounds like it in BindingDB:
Activity Spreadsheet -- Enzyme Inhibition Constant Data from BindingDB
Found 1 hit for monomerid = 50072221
Target4-hydroxyphenylpyruvate dioxygenase(Homo sapiens (Human))
Central China Normal University
Curated by ChEMBL
LigandPNGBDBM50072221(CHEMBL3408337)
Affinity DataIC50:  940nM. Assay description: Inhibition of human recombinant His-tagged HPPD expressed in Escherichia coli BL21(DE3) by UV/visible plate reader analysis
In DepthDetails ArticlePubMed