BDBM50072400 4-{3-[4-(4-Fluoro-phenyl)-5-(2-methoxy-pyrimidin-4-yl)-imidazol-1-yl]-propyl}-morpholine::CHEMBL14318::D3RKN_121
SMILES COc1nccc(n1)-c1c(ncn1CCCN1CCOCC1)-c1ccc(F)cc1
InChI Key InChIKey=UJPJYIXFJSSTRL-UHFFFAOYSA-N
Data  2 IC50  1 Kd
  Tab Delimited (TSV)   2D SDfile   Computed 3D by Vconf -m prep SDfile
Find this compound or compounds like it in BindingDB:
Activity Spreadsheet -- Enzyme Inhibition Constant Data from BindingDB
Found 3 hits for monomerid = 50072400
TargetMitogen-activated protein kinase 14(Homo sapiens (Human))
Glaxosmithkline
Curated by ChEMBL
LigandPNGBDBM50072400(4-{3-[4-(4-Fluoro-phenyl)-5-(2-methoxy-pyrimidin-4...)
Affinity DataIC50:  300nM. Assay description: Inhibitory concentration against mitogen-activated protein kinase p38 alpha
In DepthDetails ArticlePubMed
TargetAngiopoietin-1 receptor(Homo sapiens (Human))
D3R/Abbott
LigandPNGBDBM50072400(4-{3-[4-(4-Fluoro-phenyl)-5-(2-methoxy-pyrimidin-4...)
Affinity DataKd:  1.00E+4nM. Assay description: D3R2025
In DepthDetails PubMed
TargetMitogen-activated protein kinase 11/12/13/14(Homo sapiens (Human))
Smithkline Beecham Pharmaceuticals
Curated by ChEMBL
LigandPNGBDBM50072400(4-{3-[4-(4-Fluoro-phenyl)-5-(2-methoxy-pyrimidin-4...)
Affinity DataIC50:  300nM. Assay description: Compound was tested for inhibition of p38 MAP kinase
In DepthDetails ArticlePubMed