BDBM50072567 (7S,8R,11S)-11-Benzoyl-8-isobutyl-9-oxo-2-oxa-10-aza-bicyclo[11.2.2]heptadeca-1(16),13(17),14-triene-7-carboxylic acid hydroxyamide::CHEMBL325552
SMILES CC(C)C[C@@H]1[C@H](CCCCOc2ccc(C[C@H](NC1=O)C(=O)c1ccccc1)cc2)C(=O)NO
InChI Key InChIKey=JQYSJWITJMOASO-VXNXHJTFSA-N
Data  4 IC50
  Tab Delimited (TSV)   2D SDfile   Computed 3D by Vconf -m prep SDfile
Find this compound or compounds like it in BindingDB:
Activity Spreadsheet -- Enzyme Inhibition Constant Data from BindingDB
Found 4 hits for monomerid = 50072567
TargetMatrilysin(Homo sapiens (Human))
Abbott Laboratories
Curated by ChEMBL
LigandPNGBDBM50072567((7S,8R,11S)-11-Benzoyl-8-isobutyl-9-oxo-2-oxa-10-a...)
Affinity DataIC50:  3.30nM. Assay description: In vitro inhibitory activity against human recombinant matrix metalloproteinase 7
In DepthDetails ArticlePubMed
Target72 kDa type IV collagenase(Homo sapiens (Human))
Abbott Laboratories
Curated by ChEMBL
LigandPNGBDBM50072567((7S,8R,11S)-11-Benzoyl-8-isobutyl-9-oxo-2-oxa-10-a...)
Affinity DataIC50:  9.5nM. Assay description: In vitro inhibitory activity against matrix metalloproteinase 2 isolated from human HT-1080 fibrosarcoma cells induced with TNF
In DepthDetails ArticlePubMed
TargetInterstitial collagenase(Homo sapiens (Human))
Abbott Laboratories
Curated by ChEMBL
LigandPNGBDBM50072567((7S,8R,11S)-11-Benzoyl-8-isobutyl-9-oxo-2-oxa-10-a...)
Affinity DataIC50:  13nM. Assay description: In vitro inhibitory activity against matrix metalloproteinase 1 isolated from the culture medium of human skin fibroblasts induced with PMA
In DepthDetails ArticlePubMed
TargetStromelysin-1(Homo sapiens (Human))
Abbott Laboratories
Curated by ChEMBL
LigandPNGBDBM50072567((7S,8R,11S)-11-Benzoyl-8-isobutyl-9-oxo-2-oxa-10-a...)
Affinity DataIC50:  8.90nM. Assay description: In vitro inhibitory activity against human recombinant matrix metalloproteinase 3
In DepthDetails ArticlePubMed