BDBM50072801 4-[2-(4-Carbamoyl-furazan-3-ylmethoxy)-phenyl]-2,6-dimethyl-1,4-dihydro-pyridine-3,5-dicarboxylic acid dimethyl ester::CHEMBL150433
SMILES COC(=O)C1C(C(C(=O)OC)=C(C)N=C1C)c1ccccc1OCc1nonc1C(N)=O
InChI Key InChIKey=VZSIUHVYWPTTCR-UHFFFAOYSA-N
Data  1 KI  1 IC50
  Tab Delimited (TSV)   2D SDfile   Computed 3D by Vconf -m prep SDfile
Find this compound or compounds like it in BindingDB:
Activity Spreadsheet -- Enzyme Inhibition Constant Data from BindingDB
Found 2 hits for monomerid = 50072801
TargetVoltage-dependent L-type calcium channel subunit alpha-1D(Rattus norvegicus)
Universit£
Curated by ChEMBL
LigandPNGBDBM50072801(4-[2-(4-Carbamoyl-furazan-3-ylmethoxy)-phenyl]-2,6...)
Affinity DataKi:  400nM. Assay description: Binding affinity for L-type [Ca2+] channels was measured through displacement of [3H]nitrendipine on rat cortex homogenates.
In DepthDetails ArticlePubMed
TargetVoltage-dependent L-type calcium channel subunit alpha-1D(Rattus norvegicus)
Universit£
Curated by ChEMBL
LigandPNGBDBM50072801(4-[2-(4-Carbamoyl-furazan-3-ylmethoxy)-phenyl]-2,6...)
Affinity DataIC50:  880nM. Assay description: Inhibitory concentration for L-type [Ca2+] channels was measured through displacement of [3H]nitrendipine on rat cortex homogenates.
In DepthDetails ArticlePubMed