BDBM50072808 4-[3-(4-Carbamoyl-5-oxy-furazan-3-ylmethoxy)-phenyl]-2,6-dimethyl-1,4-dihydro-pyridine-3,5-dicarboxylic acid dimethyl ester::CHEMBL151759
SMILES COC(=O)C1=C(C)[N-]C(C)=C(C1c1cccc(OCc2no[n+]([O-])c2C(N)=O)c1)C(=[OH+])OC
InChI Key InChIKey=SGERSVJPBPVAPK-UHFFFAOYSA-N
Data  1 KI  1 IC50
  Tab Delimited (TSV)   2D SDfile   Computed 3D by Vconf -m prep SDfile
Find this compound or compounds like it in BindingDB:
Activity Spreadsheet -- Enzyme Inhibition Constant Data from BindingDB
Found 2 hits for monomerid = 50072808
TargetVoltage-dependent L-type calcium channel subunit alpha-1D(Rattus norvegicus)
Universit£
Curated by ChEMBL
LigandPNGBDBM50072808(4-[3-(4-Carbamoyl-5-oxy-furazan-3-ylmethoxy)-pheny...)
Affinity DataKi:  920nM. Assay description: Binding affinity for L-type [Ca2+] channels was measured through displacement of [3H]nitrendipine on rat cortex homogenates.
In DepthDetails ArticlePubMed
TargetVoltage-dependent L-type calcium channel subunit alpha-1D(Rattus norvegicus)
Universit£
Curated by ChEMBL
LigandPNGBDBM50072808(4-[3-(4-Carbamoyl-5-oxy-furazan-3-ylmethoxy)-pheny...)
Affinity DataIC50:  2.00E+3nM. Assay description: Inhibitory concentration for L-type [Ca2+] channels was measured through displacement of [3H]nitrendipine on rat cortex homogenates.
In DepthDetails ArticlePubMed