BDBM50072831 CHEMBL3410037
SMILES Cc1c[nH]c2ncnc(-c3ccc(NC(=O)N(CCO)c4ccccc4F)cc3)c12
InChI Key InChIKey=JZEWYKHHCPIPDI-UHFFFAOYSA-N
Data  2 IC50
  Tab Delimited (TSV)   2D SDfile   Computed 3D by Vconf -m prep SDfile
Find this compound or compounds like it in BindingDB:
Activity Spreadsheet -- Enzyme Inhibition Constant Data from BindingDB
Found 2 hits for monomerid = 50072831
TargetRho-associated protein kinase 2(Homo sapiens (Human))
Translational Research Institute
Curated by ChEMBL
LigandPNGBDBM50072831(CHEMBL3410037)
Affinity DataIC50:  1.61E+3nM. Assay description: Inhibition of human ROCK2 using KEAKEKRQEQIAKRRRLSSLRASTSKSGGSQK peptide substrate, ATP and [gamma33P]ATP
In DepthDetails ArticlePubMed
TargetLIM domain kinase 1(Homo sapiens (Human))
Translational Research Institute
Curated by ChEMBL
LigandPNGBDBM50072831(CHEMBL3410037)
Affinity DataIC50:  132nM. Assay description: Inhibition of human Limk1 using cofilin substrate, ATP and [gamma33P]ATP
In DepthDetails ArticlePubMed