BDBM50072952 CHEMBL3410477
SMILES COc1ccc2n(Cc3cn(Cc4ccccc4)nn3)c3ccccc3c(=O)c2c1
InChI Key InChIKey=DOAAXNWTXPRRIZ-UHFFFAOYSA-N
Data  1 IC50
  Tab Delimited (TSV)   2D SDfile   Computed 3D by Vconf -m prep SDfile
Find this compound or compounds like it in BindingDB:
Activity Spreadsheet -- Enzyme Inhibition Constant Data from BindingDB
Found 1 hit for monomerid = 50072952
TargetAcetylcholinesterase(Electrophorus electricus (Electric eel))
Tehran University Of Medical Sciences
Curated by ChEMBL
LigandPNGBDBM50072952(CHEMBL3410477)
Affinity DataIC50:  2.40E+4nM. Assay description: Inhibition of electric eel acetylcholinesterase using acetylthiocholine iodide as substrate after 15 mins by Ellman's method
In DepthDetails ArticlePubMed