BDBM50072992 CHEMBL3410819
SMILES CCCCCOc1c(OC)ccc2cc(C(=O)NCc3ccc4OCOc4c3)c(=O)n(C)c12
InChI Key InChIKey=MMLIICXIFXSGQA-UHFFFAOYSA-N
Data  2 KI
  Tab Delimited (TSV)   2D SDfile   Computed 3D by Vconf -m prep SDfile
Find this compound or compounds like it in BindingDB:
Activity Spreadsheet -- Enzyme Inhibition Constant Data from BindingDB
Found 2 hits for monomerid = 50072992
TargetCannabinoid receptor 2(Homo sapiens (Human))
Zhejiang University
Curated by ChEMBL
LigandPNGBDBM50072992(CHEMBL3410819)
Affinity DataKi:  0.220nM. Assay description: Binding affinity to CB2 receptor (unknown origin)
In DepthDetails ArticlePubMed
TargetCannabinoid receptor 2(Homo sapiens (Human))
Zhejiang University
Curated by ChEMBL
LigandPNGBDBM50072992(CHEMBL3410819)
Affinity DataKi:  0.220nM. Assay description: Binding affinity to CB2 receptor (unknown origin)
In DepthDetails ArticlePubMed