BDBM50073002 CHEMBL3410828
SMILES CCCCCOc1c2CN(CCc3ccc(N)cc3)C(=O)c2ccc1OC
InChI Key InChIKey=YWKWOUMBEIRKQL-UHFFFAOYSA-N
Data  2 KI
  Tab Delimited (TSV)   2D SDfile   Computed 3D by Vconf -m prep SDfile
Find this compound or compounds like it in BindingDB:
Activity Spreadsheet -- Enzyme Inhibition Constant Data from BindingDB
Found 2 hits for monomerid = 50073002
TargetCannabinoid receptor 2(Homo sapiens (Human))
Zhejiang University
Curated by ChEMBL
LigandPNGBDBM50073002(CHEMBL3410828)
Affinity DataKi:  14nM. Assay description: Binding affinity to CB2 receptor (unknown origin)
In DepthDetails ArticlePubMed
TargetCannabinoid receptor 2(Homo sapiens (Human))
Zhejiang University
Curated by ChEMBL
LigandPNGBDBM50073002(CHEMBL3410828)
Affinity DataKi:  14nM. Assay description: Binding affinity to CB2 receptor (unknown origin)
In DepthDetails ArticlePubMed